Reaction Details
TargetSodium-dependent serotonin transporter
LigandBDBM50452112
Substrate/Competitorn/a
Meas. Tech.ChEBML_271
Ki 0.540000±n/a nM
Citation Rocco, VPSpinazze, PGKohn, TJHonigschmidt, NANelson, DLBradley Wainscott, DAhmad, LJShaw, JThrelkeld, PGWong, DTTakeuchi, K Advances toward new antidepressants beyond SSRIs: 1-aryloxy-3-piperidinylpropan-2-ols with dual 5-HT1A receptor antagonism/SSRI activities. Part 4. Bioorg Med Chem Lett14:2653-6 (2004) 
 
Sodium-dependent serotonin transporter
Name:Sodium-dependent serotonin transporter
Type:Multi-pass membrane protein
Mol. Mass.:70322.51
Organism:Homo sapiens (Human)
Description:P31645
Residue:630
BDBM50452112
NameBDBM50452112
Synonyms:CHEMBL2112356
TypeSmall organic molecule
Emp. Form.C27H32N2O2S
Mol. Mass.448.62
SMILESC[C@H]1C[C@@H](CCN1C[C@H](O)COc1cccc2[nH]c(C)cc12)c1ccc2scc(C)c2c1