Reaction Details
Target5-hydroxytryptamine receptor 1A
LigandBDBM50452109
Substrate/Competitorn/a
Meas. Tech.ChEBML_922
Ki 4.5±n/a nM
Citation Rocco, VPSpinazze, PGKohn, TJHonigschmidt, NANelson, DLBradley Wainscott, DAhmad, LJShaw, JThrelkeld, PGWong, DTTakeuchi, K Advances toward new antidepressants beyond SSRIs: 1-aryloxy-3-piperidinylpropan-2-ols with dual 5-HT1A receptor antagonism/SSRI activities. Part 4. Bioorg Med Chem Lett14:2653-6 (2004) 
 
5-hydroxytryptamine receptor 1A
Name:5-hydroxytryptamine receptor 1A
Type:n/a
Mol. Mass.:46122.49
Organism:Homo sapiens (Human)
Description:n/a
Residue:422
BDBM50452109
NameBDBM50452109
Synonyms:CHEMBL2112358
TypeSmall organic molecule
Emp. Form.C26H30N2O2S
Mol. Mass.434.594
SMILESC[C@H]1C[C@@H](CCN1C[C@H](O)COc1cccc2[nH]c(C)cc12)c1ccc2ccsc2c1