Reaction Details
Target5-hydroxytryptamine receptor 1A
LigandBDBM50452115
Substrate/Competitorn/a
Meas. Tech.ChEBML_922
Ki 1.2±n/a nM
Citation Rocco, VPSpinazze, PGKohn, TJHonigschmidt, NANelson, DLBradley Wainscott, DAhmad, LJShaw, JThrelkeld, PGWong, DTTakeuchi, K Advances toward new antidepressants beyond SSRIs: 1-aryloxy-3-piperidinylpropan-2-ols with dual 5-HT1A receptor antagonism/SSRI activities. Part 4. Bioorg Med Chem Lett14:2653-6 (2004) 
 
5-hydroxytryptamine receptor 1A
Name:5-hydroxytryptamine receptor 1A
Type:n/a
Mol. Mass.:46122.49
Organism:Homo sapiens (Human)
Description:n/a
Residue:422
BDBM50452115
NameBDBM50452115
Synonyms:CHEMBL2112352
TypeSmall organic molecule
Emp. Form.C26H30N2O3
Mol. Mass.418.528
SMILESC[C@H]1C[C@@H](CCN1C[C@H](O)COc1cccc2[nH]c(C)cc12)c1cccc2occc12