Reaction Details
Target5-hydroxytryptamine receptor 1A
LigandBDBM50145589
Substrate/Competitorn/a
Meas. Tech.ChEBML_922
Ki 1.4±n/a nM
Citation Rocco, VPSpinazze, PGKohn, TJHonigschmidt, NANelson, DLBradley Wainscott, DAhmad, LJShaw, JThrelkeld, PGWong, DTTakeuchi, K Advances toward new antidepressants beyond SSRIs: 1-aryloxy-3-piperidinylpropan-2-ols with dual 5-HT1A receptor antagonism/SSRI activities. Part 4. Bioorg Med Chem Lett14:2653-6 (2004) 
 
5-hydroxytryptamine receptor 1A
Name:5-hydroxytryptamine receptor 1A
Type:n/a
Mol. Mass.:46122.49
Organism:Homo sapiens (Human)
Description:n/a
Residue:422
BDBM50145589
NameBDBM50145589
Synonyms:(R)-1-((3S,4R)-4-Benzofuran-5-yl-2-methyl-piperidin-1-yl)-3-(2-methyl-1H-indol-4-yloxy)-propan-2-ol | CHEMBL329583
TypeSmall organic molecule
Emp. Form.C26H30N2O3
Mol. Mass.418.528
SMILESC[C@H]1C[C@@H](CCN1C[C@@H](O)COc1cccc2[nH]c(C)cc12)c1ccc2occc2c1