Reaction Details
TargetCaspase-1
LigandBDBM50145661
Substrate/Competitorn/a
Meas. Tech.ChEBML_46513
IC50 27±n/a nM
Citation Linton, SDAja, TAllegrini, PRDeckwerth, TLDiaz, JLHengerer, BHerrmann, JJahangiri, KGKallen, JKaranewsky, DSMeduna, SPNalley, KRobinson, EDRoggo, SRovelli, GSauter, ASayers, ROSchmitz, ASmidt, RTernansky, RJTomaselli, KJUllman, BRWiessner, CWu, JC Oxamyl dipeptide caspase inhibitors developed for the treatment of stroke. Bioorg Med Chem Lett14:2685-91 (2004) 
 
Caspase-1
Name:Caspase-1
Type:PROTEIN
Mol. Mass.:45636.44
Organism:Mus musculus
Description:ChEMBL_651546
Residue:402
BDBM50145661
NameBDBM50145661
Synonyms:(S)-3-{(S)-4-Methyl-2-[(naphthalen-1-ylaminooxalyl)-amino]-pentanoylamino}-4-oxo-butyric acid | CHEMBL90307
TypeSmall organic molecule
Emp. Form.C22H25N3O6
Mol. Mass.427.4504
SMILESCC(C)C[C@H](NC(=O)C(=O)Nc1cccc2ccccc12)C(=O)N[C@@H](CC(O)=O)C=O