Reaction Details
TargetPeroxisome proliferator-activated receptor gamma
LigandBDBM50145712
Substrate/Competitorn/a
Meas. Tech.ChEMBL_153619 (CHEMBL760384)
IC50 18±n/a nM
Citation Xu, YRito, CJEtgen, GJArdecky, RJBean, JSBensch, WRBosley, JRBroderick, CLBrooks, DADominianni, SJHahn, PJLiu, SMais, DEMontrose-Rafizadeh, COgilvie, KMOldham, BAPeters, MRungta, DKShuker, AJStephenson, GATripp, AEWilson, SBWinneroski, LLZink, RKauffman, RFMcCarthy, JR Design and synthesis of alpha-aryloxy-alpha-methylhydrocinnamic acids: a novel class of dual peroxisome proliferator-activated receptor alpha/gamma agonists. J Med Chem47:2422-5 (2004) 
 
Peroxisome proliferator-activated receptor gamma
Name:Peroxisome proliferator-activated receptor gamma
Type:Nuclear Receptor
Mol. Mass.:57613.46
Organism:Homo sapiens (Human)
Description:P37231
Residue:505
BDBM50145712
NameBDBM50145712
Synonyms:2-Methyl-3-{4-[2-(5-methyl-2-phenyl-oxazol-4-yl)-ethoxy]-phenyl}-2-phenoxy-propionic acid | CHEMBL82034
TypeSmall organic molecule
Emp. Form.C28H27NO5
Mol. Mass.457.5177
SMILESCc1oc(nc1CCOc1ccc(CC(C)(Oc2ccccc2)C(O)=O)cc1)-c1ccccc1