Reaction Details
TargetNAD-dependent histone deacetylase SIR2
LigandBDBM50146047
Substrate/Competitorn/a
Meas. Tech.ChEBML_202251
IC50 65000±n/a nM
Citation Posakony, JHirao, MStevens, SSimon, JABedalov, A Inhibitors of Sir2: evaluation of splitomicin analogues. J Med Chem47:2635-44 (2004) 
 
NAD-dependent histone deacetylase SIR2
Name:NAD-dependent histone deacetylase SIR2
Type:PROTEIN
Mol. Mass.:63277.80
Organism:Saccharomyces cerevisiae
Description:ChEMBL_942450
Residue:562
BDBM50146047
NameBDBM50146047
Synonyms:3,4-Dihydro-benzo[h]chromen-2-one | CHEMBL91528
TypeSmall organic molecule
Emp. Form.C13H10O2
Mol. Mass.198.2173
SMILESO=C1CCc2ccc3ccccc3c2O1