Reaction Details
TargetNAD-dependent histone deacetylase SIR2
LigandBDBM50146049
Substrate/Competitorn/a
Meas. Tech.ChEBML_202251
IC50 89000±n/a nM
Citation Posakony, JHirao, MStevens, SSimon, JABedalov, A Inhibitors of Sir2: evaluation of splitomicin analogues. J Med Chem47:2635-44 (2004) 
 
NAD-dependent histone deacetylase SIR2
Name:NAD-dependent histone deacetylase SIR2
Type:PROTEIN
Mol. Mass.:63277.80
Organism:Saccharomyces cerevisiae
Description:ChEMBL_942450
Residue:562
BDBM50146049
NameBDBM50146049
Synonyms:3,4,9,10-Tetrahydro-1,12-dioxa-triphenylene-2,11-dione | CHEMBL89791
TypeSmall organic molecule
Emp. Form.C16H12O4
Mol. Mass.268.2641
SMILESO=C1CCc2c(O1)c1OC(=O)CCc1c1ccccc21