Reaction Details
TargetNAD-dependent histone deacetylase SIR2
LigandBDBM50146051
Substrate/Competitorn/a
Meas. Tech.ChEBML_202251
IC50 131000±n/a nM
Citation Posakony, JHirao, MStevens, SSimon, JABedalov, A Inhibitors of Sir2: evaluation of splitomicin analogues. J Med Chem47:2635-44 (2004) 
 
NAD-dependent histone deacetylase SIR2
Name:NAD-dependent histone deacetylase SIR2
Type:PROTEIN
Mol. Mass.:63277.80
Organism:Saccharomyces cerevisiae
Description:ChEMBL_942450
Residue:562
BDBM50146051
NameBDBM50146051
Synonyms:6-Hydroxy-1,2-dihydro-benzo[f]chromen-3-one | CHEMBL328231
TypeSmall organic molecule
Emp. Form.C13H10O3
Mol. Mass.214.2167
SMILESOc1cc2OC(=O)CCc2c2ccccc12