Reaction Details
TargetNAD-dependent histone deacetylase SIR2
LigandBDBM50146053
Substrate/Competitorn/a
Meas. Tech.ChEBML_202251
IC50 86000±n/a nM
Citation Posakony, JHirao, MStevens, SSimon, JABedalov, A Inhibitors of Sir2: evaluation of splitomicin analogues. J Med Chem47:2635-44 (2004) 
 
NAD-dependent histone deacetylase SIR2
Name:NAD-dependent histone deacetylase SIR2
Type:PROTEIN
Mol. Mass.:63277.80
Organism:Saccharomyces cerevisiae
Description:ChEMBL_942450
Residue:562
BDBM50146053
NameBDBM50146053
Synonyms:Benzo[f]chromen-3-one | CHEMBL424248
TypeSmall organic molecule
Emp. Form.C13H8O2
Mol. Mass.196.2014
SMILESO=c1ccc2c(ccc3ccccc23)o1