Reaction Details
TargetNAD-dependent histone deacetylase SIR2
LigandBDBM50146054
Substrate/Competitorn/a
Meas. Tech.ChEBML_202251
IC50 52000±n/a nM
Citation Posakony, JHirao, MStevens, SSimon, JABedalov, A Inhibitors of Sir2: evaluation of splitomicin analogues. J Med Chem47:2635-44 (2004) 
 
NAD-dependent histone deacetylase SIR2
Name:NAD-dependent histone deacetylase SIR2
Type:PROTEIN
Mol. Mass.:63277.80
Organism:Saccharomyces cerevisiae
Description:ChEMBL_942450
Residue:562
BDBM50146054
NameBDBM50146054
Synonyms:2-Methyl-1,2-dihydro-benzo[f]chromen-3-one | CHEMBL86831
TypeSmall organic molecule
Emp. Form.C14H12O2
Mol. Mass.212.2439
SMILESCC1Cc2c(OC1=O)ccc1ccccc21