Reaction Details
TargetRetinoic acid receptor RXR-alpha
LigandBDBM50146335
Substrate/Competitorn/a
Meas. Tech.ChEMBL_196620 (CHEMBL800656)
EC50 4154±n/a nM
Citation Gernert, DLNeel, DABoehm, MFLeibowitz, MDMais, DAMichellys, PYRungta, DReifel-Miller, AGrese, TA Design and synthesis of benzofused heterocyclic RXR modulators. Bioorg Med Chem Lett14:2759-63 (2004) 
 
Retinoic acid receptor RXR-alpha
Name:Retinoic acid receptor RXR-alpha
Type:PROTEIN
Mol. Mass.:50820.38
Organism:Homo sapiens (Human)
Description:ChEMBL_1456363
Residue:462
BDBM50146335
NameBDBM50146335
Synonyms:(E)-3-{3-[2-(3-Fluoro-propoxy)-3,5-diisopropyl-phenyl]-benzo[b]thiophen-5-yl}-but-2-enoic acid | CHEMBL264746
TypeSmall organic molecule
Emp. Form.C27H31FO3S
Mol. Mass.454.597
SMILESCC(C)c1cc(C(C)C)c(OCCCF)c(c1)-c1csc2ccc(cc12)C(\C)=C\C(O)=O