Reaction Details
TargetRetinoic acid receptor gamma
LigandBDBM50129726
Substrate/Competitorn/a
Meas. Tech.ChEBML_195979
Ki>10000±n/a nM
Citation Gernert, DLNeel, DABoehm, MFLeibowitz, MDMais, DAMichellys, PYRungta, DReifel-Miller, AGrese, TA Design and synthesis of benzofused heterocyclic RXR modulators. Bioorg Med Chem Lett14:2759-63 (2004) 
 
Retinoic acid receptor gamma
Name:Retinoic acid receptor gamma
Type:PROTEIN
Mol. Mass.:50345.43
Organism:Homo sapiens (Human)
Description:ChEMBL_1458016
Residue:454
BDBM50129726
NameBDBM50129726
Synonyms:(2E,4E,6Z)-7-(2-Ethoxy-3,5-diisopropyl-phenyl)-3-methyl-octa-2,4,6-trienoic acid CHEMBL88740
TypeSmall organic molecule
Emp. Form.C23H32O3
Mol. Mass.356.4984
SMILESCCOc1c(cc(cc1\C(C)=C/C=C/C(/C)=C/C(O)=O)C(C)C)C(C)C