Reaction Details
TargetRetinoic acid receptor RXR-alpha
LigandBDBM50146333
Substrate/Competitorn/a
Meas. Tech.ChEMBL_196620 (CHEMBL800656)
EC50 3976±n/a nM
Citation Gernert, DLNeel, DABoehm, MFLeibowitz, MDMais, DAMichellys, PYRungta, DReifel-Miller, AGrese, TA Design and synthesis of benzofused heterocyclic RXR modulators. Bioorg Med Chem Lett14:2759-63 (2004) 
 
Retinoic acid receptor RXR-alpha
Name:Retinoic acid receptor RXR-alpha
Type:PROTEIN
Mol. Mass.:50820.38
Organism:Homo sapiens (Human)
Description:ChEMBL_1456363
Residue:462
BDBM50146333
NameBDBM50146333
Synonyms:(E)-3-[4-(2-Butoxy-3,5-diisopropyl-phenyl)-1H-indol-2-yl]-but-2-enoic acid | CHEMBL93128
TypeSmall organic molecule
Emp. Form.C28H35NO3
Mol. Mass.433.5824
SMILESCCCCOc1c(cc(cc1-c1cccc2[nH]c(cc12)C(\C)=C\C(O)=O)C(C)C)C(C)C