Reaction Details
TargetRetinoic acid receptor gamma
LigandBDBM50146327
Substrate/Competitorn/a
Meas. Tech.ChEBML_195979
Ki>10000±n/a nM
Citation Gernert, DLNeel, DABoehm, MFLeibowitz, MDMais, DAMichellys, PYRungta, DReifel-Miller, AGrese, TA Design and synthesis of benzofused heterocyclic RXR modulators. Bioorg Med Chem Lett14:2759-63 (2004) 
 
Retinoic acid receptor gamma
Name:Retinoic acid receptor gamma
Type:PROTEIN
Mol. Mass.:50345.43
Organism:Homo sapiens (Human)
Description:ChEMBL_1458016
Residue:454
BDBM50146327
NameBDBM50146327
Synonyms:(E)-3-[3-(3,5-Di-tert-butyl-2-propoxy-phenyl)-1H-indol-5-yl]-but-2-enoic acid | CHEMBL92447
TypeSmall organic molecule
Emp. Form.C29H37NO3
Mol. Mass.447.609
SMILESCCCOc1c(cc(cc1C(C)(C)C)C(C)(C)C)-c1c[nH]c2ccc(cc12)C(\C)=C\C(O)=O