Reaction Details
TargetRetinoic acid receptor gamma
LigandBDBM50146336
Substrate/Competitorn/a
Meas. Tech.ChEBML_195979
Ki>10000±n/a nM
Citation Gernert, DLNeel, DABoehm, MFLeibowitz, MDMais, DAMichellys, PYRungta, DReifel-Miller, AGrese, TA Design and synthesis of benzofused heterocyclic RXR modulators. Bioorg Med Chem Lett14:2759-63 (2004) 
 
Retinoic acid receptor gamma
Name:Retinoic acid receptor gamma
Type:PROTEIN
Mol. Mass.:50345.43
Organism:Homo sapiens (Human)
Description:ChEMBL_1458016
Residue:454
BDBM50146336
NameBDBM50146336
Synonyms:(E)-3-[3-(2-Ethoxy-3,5-diisopropyl-phenyl)-imidazo[1,2-a]pyridin-6-yl]-but-2-enoic acid | CHEMBL328072
TypeSmall organic molecule
Emp. Form.C25H30N2O3
Mol. Mass.406.5173
SMILESCCOc1c(cc(cc1-c1cnc2ccc(cn12)C(\C)=C\C(O)=O)C(C)C)C(C)C