Reaction Details
TargetRetinoic acid receptor RXR-alpha
LigandBDBM50146336
Substrate/Competitorn/a
Meas. Tech.ChEMBL_196624 (CHEMBL800659)
Ki 2078±n/a nM
Citation Gernert, DLNeel, DABoehm, MFLeibowitz, MDMais, DAMichellys, PYRungta, DReifel-Miller, AGrese, TA Design and synthesis of benzofused heterocyclic RXR modulators. Bioorg Med Chem Lett14:2759-63 (2004) 
 
Retinoic acid receptor RXR-alpha
Name:Retinoic acid receptor RXR-alpha
Type:PROTEIN
Mol. Mass.:50820.38
Organism:Homo sapiens (Human)
Description:ChEMBL_1456363
Residue:462
BDBM50146336
NameBDBM50146336
Synonyms:(E)-3-[3-(2-Ethoxy-3,5-diisopropyl-phenyl)-imidazo[1,2-a]pyridin-6-yl]-but-2-enoic acid | CHEMBL328072
TypeSmall organic molecule
Emp. Form.C25H30N2O3
Mol. Mass.406.5173
SMILESCCOc1c(cc(cc1-c1cnc2ccc(cn12)C(\C)=C\C(O)=O)C(C)C)C(C)C