Reaction Details
TargetPotassium voltage-gated channel subfamily A member 5
LigandBDBM50123521
Substrate/Competitorn/a
Meas. Tech.ChEBML_214965
IC50 200±n/a nM
Citation Peukert, SBrendel, JPirard, BStrübing, CKleemann, HWBöhme, THemmerle, H Pharmacophore-based search, synthesis, and biological evaluation of anthranilic amides as novel blockers of the Kv1.5 channel. Bioorg Med Chem Lett14:2823-7 (2004) 
 
Potassium voltage-gated channel subfamily A member 5
Name:Potassium voltage-gated channel subfamily A member 5
Type:Enzyme
Mol. Mass.:67222.47
Organism:Homo sapiens (Human)
Description:P22460
Residue:613
BDBM50123521
NameBDBM50123521
Synonyms:CHEMBL317791 [2'-(2-Pyridin-2-yl-ethylcarbamoyl)-biphenyl-2-ylmethyl]-carbamic acid 1-phenyl-ethyl ester
TypeSmall organic molecule
Emp. Form.C30H29N3O3
Mol. Mass.479.5696
SMILESC[C@H](OC(=O)NCc1ccccc1-c1ccccc1C(=O)NCCc1ccccn1)c1ccccc1