Reaction Details
TargetProtein kinase C alpha type
LigandBDBM50146559
Substrate/Competitorn/a
Meas. Tech.ChEBML_160132
Ki 122±n/a nM
Citation Baba, YOgoshi, YHirai, GYanagisawa, TNagamatsu, KMayumi, SHashimoto, YSodeoka, M Design, synthesis, and structure-activity relationship of new isobenzofuranone ligands of protein kinase C. Bioorg Med Chem Lett14:2963-7 (2004) 
 
Protein kinase C alpha type
Name:Protein kinase C alpha type
Type:Enzyme
Mol. Mass.:76755.65
Organism:Homo sapiens (Human)
Description:The recombinant human PKC enzymes were produced using a baculovirus expression system in SF9 cells
Residue:672
BDBM50146559
NameBDBM50146559
Synonyms:But-3-enoic acid (R)-1-acetoxymethyl-1-hydroxymethyl-3-oxo-1,3-dihydro-isobenzofuran-4-yl ester | CHEMBL101616
TypeSmall organic molecule
Emp. Form.C16H16O7
Mol. Mass.320.294
SMILESCC(=O)OC[C@@]1(CO)OC(=O)c2c1cccc2OC(=O)CC=C