Reaction Details
TargetProtein kinase C alpha type
LigandBDBM50146557
Substrate/Competitorn/a
Meas. Tech.ChEBML_160132
Ki 540±n/a nM
Citation Baba, YOgoshi, YHirai, GYanagisawa, TNagamatsu, KMayumi, SHashimoto, YSodeoka, M Design, synthesis, and structure-activity relationship of new isobenzofuranone ligands of protein kinase C. Bioorg Med Chem Lett14:2963-7 (2004) 
 
Protein kinase C alpha type
Name:Protein kinase C alpha type
Type:Enzyme
Mol. Mass.:76755.65
Organism:Homo sapiens (Human)
Description:The recombinant human PKC enzymes were produced using a baculovirus expression system in SF9 cells
Residue:672
BDBM50146557
NameBDBM50146557
Synonyms:Acetic acid (R)-4-benzyloxy-1-hydroxymethyl-3-oxo-1,3-dihydro-isobenzofuran-1-ylmethyl ester | CHEMBL322865
TypeSmall organic molecule
Emp. Form.C19H18O6
Mol. Mass.342.3426
SMILESCC(=O)OC[C@@]1(CO)OC(=O)c2c1cccc2OCc1ccccc1