Reaction Details
TargetDNA topoisomerase 2-alpha
LigandBDBM50147398
Substrate/Competitorn/a
Meas. Tech.ChEBML_54503
IC50 20000±n/a nM
Citation Wang, BBMaghami, NGoodlin, VLSmith, PJ Critical structural motif for the catalytic inhibition of human topoisomerase II by UK-1 and analogs. Bioorg Med Chem Lett14:3221-6 (2004) 
 
DNA topoisomerase 2-alpha
Name:DNA topoisomerase 2-alpha
Type:Protein
Mol. Mass.:174415.30
Organism:Homo sapiens (Human)
Description:P11388
Residue:1531
BDBM50147398
NameBDBM50147398
Synonyms:2-[2,4']Bibenzooxazolyl-2'-yl-phenol | CHEMBL323957
TypeSmall organic molecule
Emp. Form.C20H12N2O3
Mol. Mass.328.3209
SMILESOc1ccccc1-c1nc2c(cccc2o1)-c1nc2ccccc2o1