Reaction Details
TargetDNA topoisomerase 2-alpha
LigandBDBM50147399
Substrate/Competitorn/a
Meas. Tech.ChEMBL_54504 (CHEMBL663852)
IC50 50000±n/a nM
Citation Wang, BBMaghami, NGoodlin, VLSmith, PJ Critical structural motif for the catalytic inhibition of human topoisomerase II by UK-1 and analogs. Bioorg Med Chem Lett14:3221-6 (2004) 
 
DNA topoisomerase 2-alpha
Name:DNA topoisomerase 2-alpha
Type:Protein
Mol. Mass.:174415.30
Organism:Homo sapiens (Human)
Description:P11388
Residue:1531
BDBM50147399
NameBDBM50147399
Synonyms:2'-(2-Hydroxy-phenyl)-[2,4']bibenzooxazolyl-4-carboxylic acid methyl ester methyl 2-(2-(2-hydroxyphenyl)benzo[d]oxazol-4-yl)benzo[d]oxazole-4-carboxylate
TypeSmall organic molecule
Emp. Form.C22H14N2O5
Mol. Mass.386.357
SMILESCOC(=O)c1cccc2oc(nc12)-c1cccc2oc(nc12)-c1ccccc1O