Reaction Details
TargetKappa-type opioid receptor
LigandBDBM50148076
Substrate/Competitorn/a
Meas. Tech.ChEMBL_145819 (CHEMBL753530)
Ki 5840±n/a nM
Citation Spetea, MSchüllner, FMoisa, RCBerzetei-Gurske, IPSchraml, BDörfler, CAceto, MDHarris, LSCoop, ASchmidhammer, H Synthesis and biological evaluation of 14-alkoxymorphinans. 21. Novel 4-alkoxy and 14-phenylpropoxy derivatives of the mu opioid receptor antagonist cyprodime. J Med Chem47:3242-7 (2004) 
 
Kappa-type opioid receptor
Name:Kappa-type opioid receptor
Type:G Protein-Coupled Receptor (GPCR)
Mol. Mass.:42692.90
Organism:Rattus norvegicus (rat)
Description:P34975
Residue:380
BDBM50148076
NameBDBM50148076
Synonyms:17-cyclopropylmethyl-3-hydroxy-10-(3-phenylpropoxy)-(1R,9R,10S)-17-azatetracyclo[7.5.3.01,10.02,7]heptadeca-2(7),3,5-trien-13-one | CHEMBL325347
TypeSmall organic molecule
Emp. Form.C29H35NO3
Mol. Mass.445.5931
SMILESOc1cccc2C[C@H]3N(CC4CC4)CCC4(CC(=O)CC[C@@]34OCCCc3ccccc3)c12