Reaction Details
TargetMu-type opioid receptor
LigandBDBM50148070
Substrate/Competitorn/a
Meas. Tech.ChEMBL_148988 (CHEMBL754204)
Ki 13800±n/a nM
Citation Spetea, MSchüllner, FMoisa, RCBerzetei-Gurske, IPSchraml, BDörfler, CAceto, MDHarris, LSCoop, ASchmidhammer, H Synthesis and biological evaluation of 14-alkoxymorphinans. 21. Novel 4-alkoxy and 14-phenylpropoxy derivatives of the mu opioid receptor antagonist cyprodime. J Med Chem47:3242-7 (2004) 
 
Mu-type opioid receptor
Name:Mu-type opioid receptor
Type:G Protein-Coupled Receptor (GPCR)
Mol. Mass.:44503.11
Organism:Rattus norvegicus (rat)
Description:Competition binding assays were carried out using membrane preparations from transfected HN9.10 cells that constitutively expressed the mu opioid receptor.
Residue:398
BDBM50148070
NameBDBM50148070
Synonyms:3-butoxy-17-cyclopropylmethyl-10-methoxy-(1R,9R,10S)-17-azatetracyclo[7.5.3.01,10.02,7]heptadeca-2(7),3,5-trien-13-one | CHEMBL326860
TypeSmall organic molecule
Emp. Form.C25H35NO3
Mol. Mass.397.5503
SMILESCCCCOc1cccc2C[C@H]3N(CC4CC4)CCC4(CC(=O)CC[C@@]34OC)c12