Reaction Details
TargetCytochrome P450 3A4
LigandBDBM50148637
Substrate/Competitorn/a
Meas. Tech.ChEMBL_51912 (CHEMBL666018)
IC50 30000±n/a nM
Citation Peters, JUHunziker, DFischer, HKansy, MWeber, SKritter, SMüller, AWallier, ARicklin, FBoehringer, MPoli, SMCsato, MLoeffler, BM An aminomethylpyrimidine DPP-IV inhibitor with improved properties. Bioorg Med Chem Lett14:3575-8 (2004) 
 
Cytochrome P450 3A4
Name:Cytochrome P450 3A4
Type:Enzyme
Mol. Mass.:57349.57
Organism:Homo sapiens (Human)
Description:n/a
Residue:503
BDBM50148637
NameBDBM50148637
Synonyms:5-(aminomethyl)-6-(2,4-dichlorophenyl)-N2-(2-methoxyethyl)-N2-methylpyrimidine-2,4-diamine CHEMBL324777
TypeSmall organic molecule
Emp. Form.C15H19Cl2N5O
Mol. Mass.356.25
SMILESCOCCN(C)c1nc(N)c(CN)c(n1)-c1ccc(Cl)cc1Cl