Reaction Details
TargetCytochrome P450 3A4
LigandBDBM11578
Substrate/Competitorn/a
Meas. Tech.ChEBML_51912
IC50 10000±n/a nM
Citation Peters, JUHunziker, DFischer, HKansy, MWeber, SKritter, SMüller, AWallier, ARicklin, FBoehringer, MPoli, SMCsato, MLoeffler, BM An aminomethylpyrimidine DPP-IV inhibitor with improved properties. Bioorg Med Chem Lett14:3575-8 (2004) 
 
Cytochrome P450 3A4
Name:Cytochrome P450 3A4
Type:Enzyme
Mol. Mass.:57349.57
Organism:Homo sapiens (Human)
Description:n/a
Residue:503
BDBM11578
NameBDBM11578
Synonyms:5-(aminomethyl)-6-(2,4-dichlorophenyl)-2-phenylpyrimidin-4-amine CHEMBL36020
TypeSmall organic molecule
Emp. Form.C17H14Cl2N4
Mol. Mass.345.226
SMILESNCc1c(N)nc(nc1-c1ccc(Cl)cc1Cl)-c1ccccc1