Reaction Details
TargetReverse transcriptase/RNaseH
LigandBDBM50148762
Substrate/Competitorn/a
Meas. Tech.ChEMBL_196375 (CHEMBL802547)
IC50 394000±n/a nM
Citation Velázquez, SLobatón, EDe Clercq, EKoontz, DLMellors, JWBalzarini, JCamarasa, MJ Hybrids of [TSAO-T]-[foscarnet]: The first conjugate of foscarnet with a non-nucleoside reverse transcriptase inhibitor through a labile covalent ester bond. J Med Chem47:3418-26 (2004) 
 
Reverse transcriptase/RNaseH
Name:Reverse transcriptase/RNaseH
Type:PROTEIN
Mol. Mass.:65229.15
Organism:Human immunodeficiency virus 1
Description:ChEMBL_1473730
Residue:566
BDBM50148762
NameBDBM50148762
Synonyms:CHEMBL3142917 | [1-[2',5'-Bis-O-(tert-butyldimethylsilyl)-beta-D-ribofuranosyl]-3-N-[3-[[[(methoxycarbonyl)hydroxyphosphonyl]oxy]-propyl]thymine]-3''-spiro-5''-(4''-amino-1'',2''-oxathiole-2'',2''-dioxide); Sodium ion
TypeSmall organic molecule
Emp. Form.C29H51N3NaO13PSSi2
Mol. Mass.791.927
SMILES[Na+].COC(=O)P([O-])(=O)OCCCn1c(=O)c(C)cn([C@@H]2O[C@H](CO[Si](C)(C)C(C)(C)C)[C@@]3(OS(=O)(=O)C=C3N)[C@H]2O[Si](C)(C)C(C)(C)C)c1=O