Reaction Details
TargetGenome polyprotein
LigandBDBM11243
Substrate/Competitorn/a
Meas. Tech.ChEBML_158643
IC50 23±n/a nM
Citation Jain, RPVederas, JC Structural variations in keto-glutamines for improved inhibition against hepatitis A virus 3C proteinase. Bioorg Med Chem Lett14:3655-8 (2004) 
 
Genome polyprotein
Name:Genome polyprotein
Type:PROTEIN
Mol. Mass.:44361.04
Organism:Human rhinovirus B
Description:ChEMBL_158953
Residue:401
BDBM11243
NameBDBM11243
Synonyms:AG7088 US11859014, Compound rupintrivir ethyl (2E,4S)-4-[((2R,5S)-2-(4-fluorobenzyl)-6-methyl-5-{[(5-methylisoxazol-3-yl)carbonyl]amino}-4-oxoheptanoyl)amino]-5-[(3S)-2-oxopyrrolidin-3-yl]pent-2-enoate med.21724, Compound 29
TypeSmall organic molecule
Emp. Form.C31H39FN4O7
Mol. Mass.598.6624
SMILESCCOC(=O)\C=C\[C@H](C[C@@H]1CCNC1=O)NC(=O)[C@@H](CC(=O)[C@@H](NC(=O)c1cc(C)on1)C(C)C)Cc1ccc(F)cc1