Reaction Details
TargetMelanocortin receptor 4
LigandBDBM50148978
Substrate/Competitorn/a
Meas. Tech.ChEBML_106507
Ki 320±n/a nM
Citation Marsilje, THRoses, JBCalderwood, EFStroud, SGForsyth, NEBlackburn, CYowe, DLMiao, WDrabic, SVBohane, MDScott Daniels, JLi, PWu, LPatane, MAClaiborne, CF Synthesis and biological evaluation of imidazole-based small molecule antagonists of the melanocortin 4 receptor (MC4-R). Bioorg Med Chem Lett14:3721-5 (2004) 
 
Melanocortin receptor 4
Name:Melanocortin receptor 4
Type:Enzyme
Mol. Mass.:36949.50
Organism:Homo sapiens (Human)
Description:P32245
Residue:332
BDBM50148978
NameBDBM50148978
Synonyms:2-{2-[2-(5-Bromo-2-methoxy-phenyl)-ethyl]-phenyl}-5-ethyl-1-methyl-1H-imidazole | CHEMBL332584
TypeSmall organic molecule
Emp. Form.C21H23BrN2O
Mol. Mass.399.324
SMILESCCc1cnc(-c2ccccc2CCc2cc(Br)ccc2OC)n1C