Reaction Details
TargetMelanocortin receptor 4
LigandBDBM50148983
Substrate/Competitorn/a
Meas. Tech.ChEBML_106507
Ki 340±n/a nM
Citation Marsilje, THRoses, JBCalderwood, EFStroud, SGForsyth, NEBlackburn, CYowe, DLMiao, WDrabic, SVBohane, MDScott Daniels, JLi, PWu, LPatane, MAClaiborne, CF Synthesis and biological evaluation of imidazole-based small molecule antagonists of the melanocortin 4 receptor (MC4-R). Bioorg Med Chem Lett14:3721-5 (2004) 
 
Melanocortin receptor 4
Name:Melanocortin receptor 4
Type:Enzyme
Mol. Mass.:36949.50
Organism:Homo sapiens (Human)
Description:P32245
Residue:332
BDBM50148983
NameBDBM50148983
Synonyms:3-{2-[2-(5-Bromo-2-methoxy-phenyl)-ethyl]-3-chloro-phenyl}-5,6,7,8-tetrahydro-imidazo[1,5-a]pyridine | CHEMBL333075
TypeSmall organic molecule
Emp. Form.C22H22BrClN2O
Mol. Mass.445.78
SMILESCOc1ccc(Br)cc1CCc1c(Cl)cccc1-c1ncc2CCCCn12