Reaction Details
TargetEstrogen receptor beta
LigandBDBM50144849
Substrate/Competitorn/a
Meas. Tech.ChEBML_67684
IC50 45±n/a nM
Citation Tan, QBirzin, ETChan, WYang, YTPai, LYHayes, ECDaSilva, CADiNinno, FRohrer, SPSchaeffer, JMHammond, ML Estrogen receptor ligands. Part 6: Synthesis and binding affinity of dihydrobenzodithiins. Bioorg Med Chem Lett14:3753-5 (2004) 
 
Estrogen receptor beta
Name:Estrogen receptor beta
Type:Protein
Mol. Mass.:59238.43
Organism:Homo sapiens (Human)
Description:Q92731
Residue:530
BDBM50144849
NameBDBM50144849
Synonyms:(2S,3R)-2-(4-(2-(PIPERIDIN-1-YL)ETHOXY)PHENYL)-2,3-DIHYDRO-3-(4-HYDROXYPHENYL)BENZO[B][1,4]OXATHIIN-6-OL CHEMBL304552
TypeSmall organic molecule
Emp. Form.C27H29NO4S
Mol. Mass.463.588
SMILESOc1ccc(cc1)[C@H]1Sc2cc(O)ccc2O[C@H]1c1ccc(OCCN2CCCCC2)cc1