Reaction Details
TargetMelanocortin receptor 4
LigandBDBM50263842
Substrate/Competitorn/a
Meas. Tech.ChEMBL_2150520 (CHEMBL5034982)
EC50 3.1±n/a nM
Citation Durek, TKaas, QWhite, AMWeidmann, JFuaad, AACheneval, OSchroeder, CIde Veer, SJDellsén, AÖsterlund, TLarsson, NKnerr, LBauer, UPlowright, ATCraik, DJ Melanocortin 1 Receptor Agonists Based on a Bivalent, Bicyclic Peptide Framework. J Med Chem64:9906-9915 (2021) 
 
Melanocortin receptor 4
Name:Melanocortin receptor 4
Type:Enzyme
Mol. Mass.:36949.50
Organism:Homo sapiens (Human)
Description:P32245
Residue:332
BDBM50263842
NameBDBM50263842
Synonyms:CHEMBL4099889
TypeSmall organic molecule
Emp. Form.C80H109N23O17S2
Mol. Mass.1728.995
SMILESCC[C@H](C)[C@@H]1NC(=O)[C@@H]2CCCN2C(=O)[C@H](Cc2c[nH]c3ccccc23)N(C)C(=O)[C@H](CCCNC(N)=N)NC(=O)[C@@H](Cc2ccccc2)NC(=O)[C@H](Cc2cnc[nH]2)NC(=O)[C@@H](NC(=O)[C@@H]2CSSC[C@H](NC1=O)C(=O)N[C@@H](Cc1ccccc1)C(=O)N1CCC[C@H]1C(=O)N[C@@H](CC(O)=O)C(=O)NCC(=O)N[C@@H](CCCNC(N)=N)C(=O)N2)[C@@H](C)O