Reaction Details
TargetDelta-type opioid receptor
LigandBDBM50149385
Substrate/Competitorn/a
Meas. Tech.ChEMBL_146918 (CHEMBL757506)
Ki 18±n/a nM
Citation Fujita, YTsuda, YLi, TMotoyama, TTakahashi, MShimizu, YYokoi, TSasaki, YAmbo, AKita, AJinsmaa, YBryant, SDLazarus, LHOkada, Y Development of potent bifunctional endomorphin-2 analogues with mixed mu-/delta-opioid agonist and delta-opioid antagonist properties. J Med Chem47:3591-9 (2004) 
 
Delta-type opioid receptor
Name:Delta-type opioid receptor
Type:G Protein-Coupled Receptor (GPCR)
Mol. Mass.:40465.04
Organism:Rattus norvegicus (rat)
Description:Competition binding assays were using CHO-K1 cell membranes expressing the opioid receptor.
Residue:372
BDBM50149385
NameBDBM50149385
Synonyms:(S)-1-[(S)-2-Amino-3-(4-hydroxy-2,6-dimethyl-phenyl)-propionyl]-pyrrolidine-2-carboxylic acid ((S)-1-phenethylcarbamoyl-2-phenyl-ethyl)-amide | CHEMBL332196
TypeSmall organic molecule
Emp. Form.C33H40N4O4
Mol. Mass.556.6951
SMILESCc1cc(O)cc(C)c1C[C@H](N)C(=O)N1CCC[C@H]1C(=O)N[C@@H](Cc1ccccc1)C(=O)NCCc1ccccc1