Reaction Details
TargetDelta-type opioid receptor
LigandBDBM50149391
Substrate/Competitorn/a
Meas. Tech.ChEMBL_146918 (CHEMBL757506)
Ki 21±n/a nM
Citation Fujita, YTsuda, YLi, TMotoyama, TTakahashi, MShimizu, YYokoi, TSasaki, YAmbo, AKita, AJinsmaa, YBryant, SDLazarus, LHOkada, Y Development of potent bifunctional endomorphin-2 analogues with mixed mu-/delta-opioid agonist and delta-opioid antagonist properties. J Med Chem47:3591-9 (2004) 
 
Delta-type opioid receptor
Name:Delta-type opioid receptor
Type:G Protein-Coupled Receptor (GPCR)
Mol. Mass.:40465.04
Organism:Rattus norvegicus (rat)
Description:Competition binding assays were using CHO-K1 cell membranes expressing the opioid receptor.
Residue:372
BDBM50149391
NameBDBM50149391
Synonyms:1-[(S)-2-Amino-3-(4-hydroxy-2,6-dimethyl-phenyl)-propionyl]-pyrrolidine-2-carboxylic acid [2-phenyl-1-((S)-phenylcarbamoyl)-ethyl]-amide | CHEMBL120091
TypeSmall organic molecule
Emp. Form.C31H36N4O4
Mol. Mass.528.6419
SMILESCc1cc(O)cc(C)c1C[C@H](N)C(=O)N1CCC[C@H]1C(=O)N[C@@H](Cc1ccccc1)C(=O)Nc1ccccc1