Reaction Details
Target17beta-hydroxysteroid dehydrogenase
LigandBDBM50149605
Substrate/Competitorn/a
Meas. Tech.ChEMBL_306373 (CHEMBL828344)
IC50>200000±n/a nM
Citation Gobec, SSova, MKristan, KRizner, TL Cinnamic acid esters as potent inhibitors of fungal 17beta-hydroxysteroid dehydrogenase--a model enzyme of the short-chain dehydrogenase/reductase superfamily. Bioorg Med Chem Lett14:3933-6 (2004) 
 
17beta-hydroxysteroid dehydrogenase
Name:17beta-hydroxysteroid dehydrogenase
Synonyms:17-beta-hydroxysteroid-dehydrogenase
Type:PROTEIN
Mol. Mass.:28901.23
Organism:Curvularia lunata
Description:ChEMBL_306373
Residue:270
BDBM50149605
NameBDBM50149605
TypeSmall organic molecule
Emp. Form.C23H27NO3
Mol. Mass.365.4654
SMILESCCCCCCCC(=O)Nc1ccc(OC(=O)\C=C\c2ccccc2)cc1