Reaction Details
Target17beta-hydroxysteroid dehydrogenase
LigandBDBM50149607
Substrate/Competitorn/a
Meas. Tech.ChEMBL_306373 (CHEMBL828344)
IC50 2700±n/a nM
Citation Gobec, SSova, MKristan, KRizner, TL Cinnamic acid esters as potent inhibitors of fungal 17beta-hydroxysteroid dehydrogenase--a model enzyme of the short-chain dehydrogenase/reductase superfamily. Bioorg Med Chem Lett14:3933-6 (2004) 
 
17beta-hydroxysteroid dehydrogenase
Name:17beta-hydroxysteroid dehydrogenase
Synonyms:17-beta-hydroxysteroid-dehydrogenase
Type:PROTEIN
Mol. Mass.:28901.23
Organism:Curvularia lunata
Description:ChEMBL_306373
Residue:270
BDBM50149607
NameBDBM50149607
TypeSmall organic molecule
Emp. Form.C17H12O4
Mol. Mass.280.2748
SMILESO=C(OCc1ccccc1)c1cc2ccccc2oc1=O