Reaction Details
TargetMetabotropic glutamate receptor 5
LigandBDBM50149801
Substrate/Competitorn/a
Meas. Tech.ChEMBL_303098 (CHEMBL876376)
Ki 2±n/a nM
Citation Roppe, JRWang, BHuang, DTehrani, LKamenecka, TSchweiger, EJAnderson, JJBrodkin, JJiang, XCramer, MChung, JReyes-Manalo, GMunoz, BCosford, ND 5-[(2-Methyl-1,3-thiazol-4-yl)ethynyl]-2,3'-bipyridine: a highly potent, orally active metabotropic glutamate subtype 5 (mGlu5) receptor antagonist with anxiolytic activity. Bioorg Med Chem Lett14:3993-6 (2004) 
 
Metabotropic glutamate receptor 5
Name:Metabotropic glutamate receptor 5
Type:Enzyme
Mol. Mass.:131900.14
Organism:Rattus norvegicus (Rat)
Description:P31424
Residue:1203
BDBM50149801
NameBDBM50149801
Synonyms:2-Phenyl-5-(2-methylthiazol-4ylethynyl)pyridine CHEMBL184995
TypeSmall organic molecule
Emp. Form.C17H12N2S
Mol. Mass.276.356
SMILESCc1nc(cs1)C#Cc1ccc(nc1)-c1ccccc1