Reaction Details
Target5-hydroxytryptamine receptor 6
LigandBDBM50150673
Substrate/Competitorn/a
Meas. Tech.ChEMBL_305399 (CHEMBL833049)
IC50>1000±n/a nM
Citation Holmberg, PSohn, DLeideborg, RCaldirola, PZlatoidsky, PHanson, SMohell, NRosqvist, SNordvall, GJohansson, AMJohansson, R Novel 2-aminotetralin and 3-aminochroman derivatives as selective serotonin 5-HT7 receptor agonists and antagonists. J Med Chem47:3927-30 (2004) 
 
5-hydroxytryptamine receptor 6
Name:5-hydroxytryptamine receptor 6
Type:Enzyme Catalytic Domain
Mol. Mass.:46945.51
Organism:RAT
Description:5-HT6 HTR6 RAT::P31388
Residue:436
BDBM50150673
NameBDBM50150673
Synonyms:CHEMBL363466 | [(S)-5-(2,6-Dimethoxy-phenyl)-1,2,3,4-tetrahydro-naphthalen-2-yl]-dimethyl-amine
TypeSmall organic molecule
Emp. Form.C20H25NO2
Mol. Mass.311.418
SMILESCOc1cccc(OC)c1-c1cccc2C[C@H](CCc12)N(C)C