Reaction Details
TargetPolyunsaturated fatty acid lipoxygenase ALOX15
LigandBDBM50150779
Substrate/Competitorn/a
Meas. Tech.ChEMBL_305468 (CHEMBL831078)
IC50 55000±n/a nM
Citation Segraves, ENShah, RRSegraves, NLJohnson, TAWhitman, SSui, JKKenyon, VACichewicz, RHCrews, PHolman, TR Probing the activity differences of simple and complex brominated aryl compounds against 15-soybean, 15-human, and 12-human lipoxygenase. J Med Chem47:4060-5 (2004) 
 
Polyunsaturated fatty acid lipoxygenase ALOX15
Name:Polyunsaturated fatty acid lipoxygenase ALOX15
Type:Protein
Mol. Mass.:74804.05
Organism:Homo sapiens (Human)
Description:n/a
Residue:662
BDBM50150779
NameBDBM50150779
Synonyms:4-Bromo-phenol CHEMBL57284
TypeSmall organic molecule
Emp. Form.C6H5BrO
Mol. Mass.173.007
SMILESOc1ccc(Br)cc1