Reaction Details
TargetPolyunsaturated fatty acid lipoxygenase ALOX15
LigandBDBM50150784
Substrate/Competitorn/a
Meas. Tech.ChEMBL_305468 (CHEMBL831078)
IC50 900±n/a nM
Citation Segraves, ENShah, RRSegraves, NLJohnson, TAWhitman, SSui, JKKenyon, VACichewicz, RHCrews, PHolman, TR Probing the activity differences of simple and complex brominated aryl compounds against 15-soybean, 15-human, and 12-human lipoxygenase. J Med Chem47:4060-5 (2004) 
 
Polyunsaturated fatty acid lipoxygenase ALOX15
Name:Polyunsaturated fatty acid lipoxygenase ALOX15
Type:Protein
Mol. Mass.:74804.05
Organism:Homo sapiens (Human)
Description:n/a
Residue:662
BDBM50150784
NameBDBM50150784
Synonyms:3,4,6,8-Tetrabromo-dibenzo[1,4]dioxin-1-ol spongiadioxin A
TypeSmall organic molecule
Emp. Form.C12H4Br4O3
Mol. Mass.515.774
SMILESOc1cc(Br)c(Br)c2Oc3c(Br)cc(Br)cc3Oc12