Reaction Details
TargetMelanocortin receptor 5
LigandBDBM50150835
Substrate/Competitorn/a
Meas. Tech.ChEMBL_303300 (CHEMBL827433)
Ki 5.3±n/a nM
Citation Chen, CYu, JFleck, BAHoare, SRSaunders, JFoster, AC Phenylguanidines as selective nonpeptide melanocortin-5 receptor antagonists. J Med Chem47:4083-8 (2004) 
 
Melanocortin receptor 5
Name:Melanocortin receptor 5
Type:Enzyme
Mol. Mass.:36612.92
Organism:Homo sapiens (Human)
Description:P33032
Residue:325
BDBM50150835
NameBDBM50150835
Synonyms:4-[N''-(2-Amino-2-methyl-propyl)-N''''-cyclohexyl-guanidino]-N-[2-(2,4-dichloro-phenyl)-ethyl]-benzamide | CHEMBL366042
TypeSmall organic molecule
Emp. Form.C26H35Cl2N5O
Mol. Mass.504.495
SMILESCC(C)(N)CNC(Nc1ccc(cc1)C(=O)NCCc1ccc(Cl)cc1Cl)=NC1CCCCC1