Reaction Details
TargetMelanocortin receptor 3
LigandBDBM50150829
Substrate/Competitorn/a
Meas. Tech.ChEMBL_302492 (CHEMBL827182)
Ki 3900±n/a nM
Citation Chen, CYu, JFleck, BAHoare, SRSaunders, JFoster, AC Phenylguanidines as selective nonpeptide melanocortin-5 receptor antagonists. J Med Chem47:4083-8 (2004) 
 
Melanocortin receptor 3
Name:Melanocortin receptor 3
Type:Enzyme
Mol. Mass.:36044.86
Organism:Homo sapiens (Human)
Description:P41968
Residue:323
BDBM50150829
NameBDBM50150829
Synonyms:4-[(N-Cyclohexyl-3,5-dimethyl-piperazine-1-carboximidoyl)-amino]-N-[2-(2,4-dichloro-phenyl)-ethyl]-benzamide | CHEMBL363730
TypeSmall organic molecule
Emp. Form.C28H37Cl2N5O
Mol. Mass.530.532
SMILESCC1CN(CC(C)N1)C(Nc1ccc(cc1)C(=O)NCCc1ccc(Cl)cc1Cl)=NC1CCCCC1