Reaction Details
TargetMelanocortin receptor 5
LigandBDBM50150837
Substrate/Competitorn/a
Meas. Tech.ChEMBL_303300 (CHEMBL827433)
Ki 5.9±n/a nM
Citation Chen, CYu, JFleck, BAHoare, SRSaunders, JFoster, AC Phenylguanidines as selective nonpeptide melanocortin-5 receptor antagonists. J Med Chem47:4083-8 (2004) 
 
Melanocortin receptor 5
Name:Melanocortin receptor 5
Type:Enzyme
Mol. Mass.:36612.92
Organism:Homo sapiens (Human)
Description:P33032
Residue:325
BDBM50150837
NameBDBM50150837
Synonyms:4-[((S)-N-(R)-Cyclohexyl-2,5-dimethyl-piperazine-1-carboximidoyl)-amino]-N-[2-(2,4-dichloro-phenyl)-ethyl]-benzamide | CHEMBL184432
TypeSmall organic molecule
Emp. Form.C28H37Cl2N5O
Mol. Mass.530.532
SMILESC[C@H]1CN([C@H](C)CN1)C(Nc1ccc(cc1)C(=O)NCCc1ccc(Cl)cc1Cl)=NC1CCCCC1