Reaction Details
TargetMelanocortin receptor 5
LigandBDBM50150836
Substrate/Competitorn/a
Meas. Tech.ChEMBL_303300 (CHEMBL827433)
IC50 530±n/a nM
Citation Chen, CYu, JFleck, BAHoare, SRSaunders, JFoster, AC Phenylguanidines as selective nonpeptide melanocortin-5 receptor antagonists. J Med Chem47:4083-8 (2004) 
 
Melanocortin receptor 5
Name:Melanocortin receptor 5
Type:Enzyme
Mol. Mass.:36612.92
Organism:Homo sapiens (Human)
Description:P33032
Residue:325
BDBM50150836
NameBDBM50150836
Synonyms:4-(N''-Cyclohexyl-N''''-pyrrolidin-3-yl-guanidino)-N-[2-(2,4-dichloro-phenyl)-ethyl]-benzamide | CHEMBL186339
TypeSmall organic molecule
Emp. Form.C26H33Cl2N5O
Mol. Mass.502.479
SMILESClc1ccc(CCNC(=O)c2ccc(NC(NC3CCNC3)=NC3CCCCC3)cc2)c(Cl)c1