Reaction Details
TargetCannabinoid receptor 1
LigandBDBM50582407
Substrate/Competitorn/a
Meas. Tech.ChEMBL_2154514 (CHEMBL5039174)
EC50 0.310000±n/a nM
Citation Jiang, SIliopoulos-Tsoutsouvas, CTong, FBrust, CAKeenan, CMRaghav, JGHua, TWu, SHo, JHWu, YGrim, TWZvonok, NThakur, GALiu, ZJSharkey, KABohn, LMNikas, SPMakriyannis, A Novel Functionalized Cannabinoid Receptor Probes: Development of Exceptionally Potent Agonists. J Med Chem64:3870-3884 (2021) 
 
Cannabinoid receptor 1
Name:Cannabinoid receptor 1
Type:G Protein-Coupled Receptor (GPCR)
Mol. Mass.:52868.96
Organism:Homo sapiens (Human)
Description:P21554
Residue:472
BDBM50582407
NameBDBM50582407
Synonyms:CHEMBL5071417
TypeSmall organic molecule
Emp. Form.C28H41NO3
Mol. Mass.439.63
SMILES[H][C@@]12C[C@H](CO)CC[C@@]1([H])C(C)(C)Oc1cc(cc(O)c21)C1(CCCCCCC#N)CCCC1