Reaction Details
TargetAdenosine receptor A2a
LigandBDBM50151205
Substrate/Competitorn/a
Meas. Tech.ChEMBL_303190 (CHEMBL829684)
Ki 12±n/a nM
Citation Vu, CBPeng, BKumaravel, GSmits, GJin, XPhadke, DEngber, THuang, CReilly, JTam, SGrant, DHetu, GChen, LZhang, JPetter, RC Piperazine derivatives of [1,2,4]triazolo[1,5-a][1,3,5]triazine as potent and selective adenosine A2a receptor antagonists. J Med Chem47:4291-9 (2004) 
 
Adenosine receptor A2a
Name:Adenosine receptor A2a
Type:G Protein-Coupled Receptor (GPCR)
Mol. Mass.:45015.65
Organism:Rattus norvegicus (rat)
Description:Rat A2A receptors expressed in CHO cells.
Residue:410
BDBM50151205
NameBDBM50151205
Synonyms:5-[4-(2-Chloro-6-methyl-quinolin-3-ylmethyl)-piperazin-1-yl]-2-furan-2-yl-[1,2,4]triazolo[1,5-a][1,3,5]triazin-7-ylamine | CHEMBL186027
TypeSmall organic molecule
Emp. Form.C23H22ClN9O
Mol. Mass.475.933
SMILESCc1ccc2nc(Cl)c(CN3CCN(CC3)c3nc(N)n4nc(nc4n3)-c3ccco3)cc2c1