Reaction Details
TargetAdenosine receptor A2a
LigandBDBM50151171
Substrate/Competitorn/a
Meas. Tech.ChEMBL_303190 (CHEMBL829684)
Ki 6±n/a nM
Citation Vu, CBPeng, BKumaravel, GSmits, GJin, XPhadke, DEngber, THuang, CReilly, JTam, SGrant, DHetu, GChen, LZhang, JPetter, RC Piperazine derivatives of [1,2,4]triazolo[1,5-a][1,3,5]triazine as potent and selective adenosine A2a receptor antagonists. J Med Chem47:4291-9 (2004) 
 
Adenosine receptor A2a
Name:Adenosine receptor A2a
Type:G Protein-Coupled Receptor (GPCR)
Mol. Mass.:45015.65
Organism:Rattus norvegicus (rat)
Description:Rat A2A receptors expressed in CHO cells.
Residue:410
BDBM50151171
NameBDBM50151171
Synonyms:5-[4-(2-Chloro-quinolin-3-ylmethyl)-piperazin-1-yl]-2-furan-2-yl-[1,2,4]triazolo[1,5-a][1,3,5]triazin-7-ylamine | CHEMBL185967
TypeSmall organic molecule
Emp. Form.C22H20ClN9O
Mol. Mass.461.907
SMILESNc1nc(nc2nc(nn12)-c1ccco1)N1CCN(Cc2cc3ccccc3nc2Cl)CC1