Reaction Details
TargetTGF-beta receptor type-1
LigandBDBM50151351
Substrate/Competitorn/a
Meas. Tech.ChEMBL_306812 (CHEMBL830169)
IC50 1170±n/a nM
Citation Gellibert, FWoolven, JFouchet, MHMathews, NGoodland, HLovegrove, VLaroze, ANguyen, VLSautet, SWang, RJanson, CSmith, WKrysa, GBoullay, VDe Gouville, ACHuet, SHartley, D Identification of 1,5-naphthyridine derivatives as a novel series of potent and selective TGF-beta type I receptor inhibitors. J Med Chem47:4494-506 (2004) 
 
TGF-beta receptor type-1
Name:TGF-beta receptor type-1
Type:enzyme
Mol. Mass.:55968.24
Organism:Homo sapiens (Human)
Description:P36897
Residue:503
BDBM50151351
NameBDBM50151351
Synonyms:5''-Quinolin-4-yl-[2,4'']bithiazolyl-2''-ylamine CHEMBL362710
TypeSmall organic molecule
Emp. Form.C15H10N4S2
Mol. Mass.310.397
SMILESNc1nc(-c2nccs2)c(s1)-c1ccnc2ccccc12