Reaction Details
TargetTGF-beta receptor type-1
LigandBDBM50151352
Substrate/Competitorn/a
Meas. Tech.ChEMBL_305842 (CHEMBL829583)
IC50 260±n/a nM
Citation Gellibert, FWoolven, JFouchet, MHMathews, NGoodland, HLovegrove, VLaroze, ANguyen, VLSautet, SWang, RJanson, CSmith, WKrysa, GBoullay, VDe Gouville, ACHuet, SHartley, D Identification of 1,5-naphthyridine derivatives as a novel series of potent and selective TGF-beta type I receptor inhibitors. J Med Chem47:4494-506 (2004) 
 
TGF-beta receptor type-1
Name:TGF-beta receptor type-1
Type:enzyme
Mol. Mass.:55968.24
Organism:Homo sapiens (Human)
Description:P36897
Residue:503
BDBM50151352
NameBDBM50151352
Synonyms:5-(6-Methyl-[1,5]naphthyridin-4-yl)-4-pyridin-2-yl-thiazol-2-ylamine CHEMBL425177
TypeSmall organic molecule
Emp. Form.C17H13N5S
Mol. Mass.319.384
SMILESCc1ccc2nccc(-c3sc(N)nc3-c3ccccn3)c2n1