Reaction Details
TargetTGF-beta receptor type-1
LigandBDBM50151356
Substrate/Competitorn/a
Meas. Tech.ChEMBL_305842 (CHEMBL829583)
IC50 6670±n/a nM
Citation Gellibert, FWoolven, JFouchet, MHMathews, NGoodland, HLovegrove, VLaroze, ANguyen, VLSautet, SWang, RJanson, CSmith, WKrysa, GBoullay, VDe Gouville, ACHuet, SHartley, D Identification of 1,5-naphthyridine derivatives as a novel series of potent and selective TGF-beta type I receptor inhibitors. J Med Chem47:4494-506 (2004) 
 
TGF-beta receptor type-1
Name:TGF-beta receptor type-1
Type:enzyme
Mol. Mass.:55968.24
Organism:Homo sapiens (Human)
Description:P36897
Residue:503
BDBM50151356
NameBDBM50151356
Synonyms:4-(2-Fluoro-phenyl)-5-quinolin-4-yl-thiazol-2-ylamine CHEMBL184746 | D3RKN_65
TypeSmall organic molecule
Emp. Form.C18H12FN3S
Mol. Mass.321.371
SMILESNc1nc(c(s1)-c1ccnc2ccccc12)-c1ccccc1F